1. Набираем команду codeby webinar. Набираем команду для организации и проведения вебинаров. Подробнее ...

    Скрыть объявление
  2. Требуются разработчики и тестеры для проекта codebyOS. Требования для участия в проекте: Знание принципов работы ОС на базе Linux; Знание Bash; Крайне желательное знание CPP, Python, Lua; Навыки системного администрирования. Подробнее ...

    Скрыть объявление
  3. Получи 30.000 рублей. Для получения денег необходимо принять участие в конкурсе авторов codeby. С условиями и призами можно ознакомиться на этой странице ...

    Внимание! Регистрация авторов на конкурс закрыта.

    Скрыть объявление

Проблема Cout

Тема в разделе "С и С++", создана пользователем lamez, 29 сен 2006.

Статус темы:
Закрыта.
  1. lamez

    lamez Гость

    Репутация:
    0
    Вот у меня...
    'dfy.exe': Loaded 'C:\Documents and Settings\Lamezz\Mydocs\Visual Studio 2005\Projects\dfy\Debug\dfy.exe', Symbols loaded.
    'dfy.exe': Loaded 'C:\MICBILL\system32\ntdll.dll', No symbols loaded.
    'dfy.exe': Loaded 'C:\MICBILL\system32\kernel32.dll', No symbols loaded.
    'dfy.exe': Loaded 'C:\MICBILL\WinSxS\x86_Microsoft.VC80.DebugCRT_1fc8b3b9a1e18e3b_8.0.50727.42_x-ww_f75eb16c\msvcp80d.dll', No symbols loaded.
    'dfy.exe': Loaded 'C:\MICBILL\WinSxS\x86_Microsoft.VC80.DebugCRT_1fc8b3b9a1e18e3b_8.0.50727.42_x-ww_f75eb16c\msvcr80d.dll', No symbols loaded.
    'dfy.exe': Loaded 'C:\MICBILL\system32\msvcrt.dll', No symbols loaded.
    The thread 'Win32 Thread' (0x880) has exited with code -1073741510 (0xc000013a).
    The program '[2164] dfy.exe: Native' has exited with code -1073741510 (0xc000013a).

    И ещё:

    ------ Build started: Project: dfy, Configuration: Debug Win32 ------
    Compiling...
    1.cpp
    c:\documents and settings\lamezz\mydocs\visual studio 2005\projects\dfy\1.cpp(10) : error C2653: 'stf' : is not a class or namespace name
    c:\documents and settings\lamezz\mydocs\visual studio 2005\projects\dfy\1.cpp(10) : error C2065: 'cout' : undeclared identifier
    Build log was saved at "file://c:\Documents and Settings\Lamezz\Mydocs\Visual Studio 2005\Projects\dfy\Debug\BuildLog.htm"
    dfy - 2 error(s), 0 warning(s)
    ========== Build: 0 succeeded, 1 failed, 0 up-to-date, 0 skipped ==========

    ПОМОГИТЕЕЕЕ
     
  2. SunSanych

    SunSanych Well-Known Member

    Репутация:
    0
    Регистрация:
    28 июн 2006
    Сообщения:
    71
    Симпатии:
    0
    1. Непонятно, надо в отладке смотреть, где программа вываливается.


    2. c:\documents and settings\lamezz\mydocs\visual studio 2005\projects\dfy\1.cpp(10) : error C2653: 'stf' : is not a class or namespace name

    Файл 1.cpp строка 10, не 'stf', а 'std' - повнимательнее.

    Удачи.
     
  3. lamez

    lamez Гость

    Репутация:
    0
    Спасибо большое! Полазил в настройках , скачал vcredist_x86.exe и всё ок))))
     
Загрузка...
Статус темы:
Закрыта.

Поделиться этой страницей