• B правой части каждого сообщения есть стрелки и . Не стесняйтесь оценивать ответы. Чтобы автору вопроса закрыть свой тикет, надо выбрать лучший ответ. Просто нажмите значок в правой части сообщения.

  • Курсы Академии Кодебай, стартующие в мае - июне, от команды The Codeby

    1. Цифровая криминалистика и реагирование на инциденты
    2. ОС Linux (DFIR) Старт: 16 мая
    3. Анализ фишинговых атак Старт: 16 мая Устройства для тестирования на проникновение Старт: 16 мая

    Скидки до 10%

    Полный список ближайших курсов ...

tawutawu

New member
02.07.2020
3
0
BIT
0
Добрый вечер коллеги. Я недавно решил установть Empire на Kali linux и Ubuntu 20x, при установки с github небыло ошибок, но после установки
из дерриктории setup у меня выдало 4 ошибки:
Код:
Building wheels for collected packages: M2Crypto, pycrypto
  Building wheel for M2Crypto (setup.py) ... error
  ERROR: Command errored out with exit status 1:
   command: /usr/bin/python -u -c 'import sys, setuptools, tokenize; sys.argv[0] = '"'"'/tmp/pip-install-wMjfxq/M2Crypto/setup.py'"'"'; __file__='"'"'/tmp/pip-install-wMjfxq/M2Crypto/setup.py'"'"';f=getattr(tokenize, '"'"'open'"'"', open)(__file__);code=f.read().replace('"'"'\r\n'"'"', '"'"'\n'"'"');f.close();exec(compile(code, __file__, '"'"'exec'"'"'))' bdist_wheel -d /tmp/pip-wheel-dCCequ          
       cwd: /tmp/pip-install-wMjfxq/M2Crypto/                                   
  Complete output (52 lines):                                                   
  running bdist_wheel                                                           
  running build                                                                 
  running build_py                                                              
  copying M2Crypto/callback.py -> build/lib.linux-x86_64-2.7/M2Crypto           
  copying M2Crypto/Rand.py -> build/lib.linux-x86_64-2.7/M2Crypto               
  copying M2Crypto/ftpslib.py -> build/lib.linux-x86_64-2.7/M2Crypto            
  copying M2Crypto/Err.py -> build/lib.linux-x86_64-2.7/M2Crypto                
  copying M2Crypto/RSA.py -> build/lib.linux-x86_64-2.7/M2Crypto                
  copying M2Crypto/SMIME.py -> build/lib.linux-x86_64-2.7/M2Crypto              
  copying M2Crypto/AuthCookie.py -> build/lib.linux-x86_64-2.7/M2Crypto         
  copying M2Crypto/m2.py -> build/lib.linux-x86_64-2.7/M2Crypto                 
  copying M2Crypto/EC.py -> build/lib.linux-x86_64-2.7/M2Crypto                 
  copying M2Crypto/m2urllib.py -> build/lib.linux-x86_64-2.7/M2Crypto           
  copying M2Crypto/httpslib.py -> build/lib.linux-x86_64-2.7/M2Crypto           
  copying M2Crypto/m2xmlrpclib.py -> build/lib.linux-x86_64-2.7/M2Crypto        
  copying M2Crypto/m2crypto.py -> build/lib.linux-x86_64-2.7/M2Crypto           
  copying M2Crypto/util.py -> build/lib.linux-x86_64-2.7/M2Crypto               
  copying M2Crypto/DSA.py -> build/lib.linux-x86_64-2.7/M2Crypto                
  copying M2Crypto/RC4.py -> build/lib.linux-x86_64-2.7/M2Crypto                
  copying M2Crypto/Engine.py -> build/lib.linux-x86_64-2.7/M2Crypto             
  copying M2Crypto/BN.py -> build/lib.linux-x86_64-2.7/M2Crypto                 
  copying M2Crypto/ASN1.py -> build/lib.linux-x86_64-2.7/M2Crypto               
  copying M2Crypto/m2urllib2.py -> build/lib.linux-x86_64-2.7/M2Crypto          
  copying M2Crypto/six.py -> build/lib.linux-x86_64-2.7/M2Crypto                
  copying M2Crypto/X509.py -> build/lib.linux-x86_64-2.7/M2Crypto               
  copying M2Crypto/EVP.py -> build/lib.linux-x86_64-2.7/M2Crypto                
  copying M2Crypto/BIO.py -> build/lib.linux-x86_64-2.7/M2Crypto                
  copying M2Crypto/DH.py -> build/lib.linux-x86_64-2.7/M2Crypto                 
  copying M2Crypto/__init__.py -> build/lib.linux-x86_64-2.7/M2Crypto           
  copying M2Crypto/threading.py -> build/lib.linux-x86_64-2.7/M2Crypto          
  creating build/lib.linux-x86_64-2.7/M2Crypto/SSL                              
  copying M2Crypto/SSL/TwistedProtocolWrapper.py -> build/lib.linux-x86_64-2.7/M2Crypto/SSL                                                                      
  copying M2Crypto/SSL/Session.py -> build/lib.linux-x86_64-2.7/M2Crypto/SSL    
  copying M2Crypto/SSL/timeout.py -> build/lib.linux-x86_64-2.7/M2Crypto/SSL    
  copying M2Crypto/SSL/Checker.py -> build/lib.linux-x86_64-2.7/M2Crypto/SSL    
  copying M2Crypto/SSL/cb.py -> build/lib.linux-x86_64-2.7/M2Crypto/SSL         
  copying M2Crypto/SSL/Cipher.py -> build/lib.linux-x86_64-2.7/M2Crypto/SSL     
  copying M2Crypto/SSL/Context.py -> build/lib.linux-x86_64-2.7/M2Crypto/SSL    
  copying M2Crypto/SSL/ssl_dispatcher.py -> build/lib.linux-x86_64-2.7/M2Crypto/SSL                                                                              
  copying M2Crypto/SSL/SSLServer.py -> build/lib.linux-x86_64-2.7/M2Crypto/SSL  
  copying M2Crypto/SSL/Connection.py -> build/lib.linux-x86_64-2.7/M2Crypto/SSL 
  copying M2Crypto/SSL/__init__.py -> build/lib.linux-x86_64-2.7/M2Crypto/SSL   
  running build_ext                                                             
  building 'M2Crypto._m2crypto' extension                                       
  creating build/temp.linux-x86_64-2.7                                          
  creating build/temp.linux-x86_64-2.7/SWIG                                     
  x86_64-linux-gnu-gcc -pthread -fno-strict-aliasing -Wdate-time -D_FORTIFY_SOURCE=2 -g -fdebug-prefix-map=/build/python2.7-uC7NI8/python2.7-2.7.18=. -fstack-protector-strong -Wformat -Werror=format-security -fPIC -I/usr/include/python2.7 -I/tmp/pip-install-wMjfxq/M2Crypto/SWIG -c SWIG/_m2crypto_wrap.c -o build/temp.linux-x86_64-2.7/SWIG/_m2crypto_wrap.o -Wno-deprecated-declarations -DTHREADING       
  SWIG/_m2crypto_wrap.c:127:10: fatal error: Python.h: Нет такого файла или каталога                                                                             
    127 | #include <Python.h>                                                   
        |          ^~~~~~~~~~                                                   
  compilation terminated.                                                       
  error: command 'x86_64-linux-gnu-gcc' failed with exit status 1               
  ----------------------------------------                                      
  ERROR: Failed building wheel for M2Crypto
  Running setup.py clean for M2Crypto
  Building wheel for pycrypto (setup.py) ... error
  ERROR: Command errored out with exit status 1:
   command: /usr/bin/python -u -c 'import sys, setuptools, tokenize; sys.argv[0] = '"'"'/tmp/pip-install-wMjfxq/pycrypto/setup.py'"'"'; __file__='"'"'/tmp/pip-install-wMjfxq/pycrypto/setup.py'"'"';f=getattr(tokenize, '"'"'open'"'"', open)(__file__);code=f.read().replace('"'"'\r\n'"'"', '"'"'\n'"'"');f.close();exec(compile(code, __file__, '"'"'exec'"'"'))' bdist_wheel -d /tmp/pip-wheel-G5Fe32          
       cwd: /tmp/pip-install-wMjfxq/pycrypto/                                   
  Complete output (212 lines):                                                  
  running bdist_wheel                                                           
  running build                                                                 
  running build_py                                                              
  creating build                                                                
  creating build/lib.linux-x86_64-2.7                                           
  creating build/lib.linux-x86_64-2.7/Crypto                                    
  copying lib/Crypto/pct_warnings.py -> build/lib.linux-x86_64-2.7/Crypto       
  copying lib/Crypto/__init__.py -> build/lib.linux-x86_64-2.7/Crypto           
  creating build/lib.linux-x86_64-2.7/Crypto/Hash                               
  copying lib/Crypto/Hash/MD2.py -> build/lib.linux-x86_64-2.7/Crypto/Hash      
  copying lib/Crypto/Hash/SHA384.py -> build/lib.linux-x86_64-2.7/Crypto/Hash   
  copying lib/Crypto/Hash/RIPEMD.py -> build/lib.linux-x86_64-2.7/Crypto/Hash   
  copying lib/Crypto/Hash/SHA512.py -> build/lib.linux-x86_64-2.7/Crypto/Hash   
  copying lib/Crypto/Hash/MD4.py -> build/lib.linux-x86_64-2.7/Crypto/Hash      
  copying lib/Crypto/Hash/SHA256.py -> build/lib.linux-x86_64-2.7/Crypto/Hash   
  copying lib/Crypto/Hash/SHA224.py -> build/lib.linux-x86_64-2.7/Crypto/Hash   
  copying lib/Crypto/Hash/hashalgo.py -> build/lib.linux-x86_64-2.7/Crypto/Hash 
  copying lib/Crypto/Hash/HMAC.py -> build/lib.linux-x86_64-2.7/Crypto/Hash     
  copying lib/Crypto/Hash/MD5.py -> build/lib.linux-x86_64-2.7/Crypto/Hash      
  copying lib/Crypto/Hash/SHA.py -> build/lib.linux-x86_64-2.7/Crypto/Hash      
  copying lib/Crypto/Hash/__init__.py -> build/lib.linux-x86_64-2.7/Crypto/Hash 
  creating build/lib.linux-x86_64-2.7/Crypto/Cipher                             
  copying lib/Crypto/Cipher/AES.py -> build/lib.linux-x86_64-2.7/Crypto/Cipher  
  copying lib/Crypto/Cipher/blockalgo.py -> build/lib.linux-x86_64-2.7/Crypto/Cipher                                                                             
  copying lib/Crypto/Cipher/Blowfish.py -> build/lib.linux-x86_64-2.7/Crypto/Cipher                                                                              
  copying lib/Crypto/Cipher/PKCS1_OAEP.py -> build/lib.linux-x86_64-2.7/Crypto/Cipher                                                                            
  copying lib/Crypto/Cipher/PKCS1_v1_5.py -> build/lib.linux-x86_64-2.7/Crypto/Cipher                                                                            
  copying lib/Crypto/Cipher/DES3.py -> build/lib.linux-x86_64-2.7/Crypto/Cipher 
  copying lib/Crypto/Cipher/CAST.py -> build/lib.linux-x86_64-2.7/Crypto/Cipher 
  copying lib/Crypto/Cipher/ARC2.py -> build/lib.linux-x86_64-2.7/Crypto/Cipher 
  copying lib/Crypto/Cipher/DES.py -> build/lib.linux-x86_64-2.7/Crypto/Cipher  
  copying lib/Crypto/Cipher/__init__.py -> build/lib.linux-x86_64-2.7/Crypto/Cipher                                                                              
  copying lib/Crypto/Cipher/XOR.py -> build/lib.linux-x86_64-2.7/Crypto/Cipher  
  copying lib/Crypto/Cipher/ARC4.py -> build/lib.linux-x86_64-2.7/Crypto/Cipher 
  creating build/lib.linux-x86_64-2.7/Crypto/Util                               
  copying lib/Crypto/Util/py21compat.py -> build/lib.linux-x86_64-2.7/Crypto/Util
  copying lib/Crypto/Util/randpool.py -> build/lib.linux-x86_64-2.7/Crypto/Util 
  copying lib/Crypto/Util/number.py -> build/lib.linux-x86_64-2.7/Crypto/Util   
  copying lib/Crypto/Util/asn1.py -> build/lib.linux-x86_64-2.7/Crypto/Util     
  copying lib/Crypto/Util/Counter.py -> build/lib.linux-x86_64-2.7/Crypto/Util  
  copying lib/Crypto/Util/RFC1751.py -> build/lib.linux-x86_64-2.7/Crypto/Util  
  copying lib/Crypto/Util/_number_new.py -> build/lib.linux-x86_64-2.7/Crypto/Util                                                                               
  copying lib/Crypto/Util/py3compat.py -> build/lib.linux-x86_64-2.7/Crypto/Util
  copying lib/Crypto/Util/winrandom.py -> build/lib.linux-x86_64-2.7/Crypto/Util
  copying lib/Crypto/Util/__init__.py -> build/lib.linux-x86_64-2.7/Crypto/Util 
  creating build/lib.linux-x86_64-2.7/Crypto/Random                             
  copying lib/Crypto/Random/random.py -> build/lib.linux-x86_64-2.7/Crypto/Random
  copying lib/Crypto/Random/_UserFriendlyRNG.py -> build/lib.linux-x86_64-2.7/Crypto/Random                                                                      
  copying lib/Crypto/Random/__init__.py -> build/lib.linux-x86_64-2.7/Crypto/Random                                                                              
  creating build/lib.linux-x86_64-2.7/Crypto/Random/Fortuna                     
  copying lib/Crypto/Random/Fortuna/FortunaGenerator.py -> build/lib.linux-x86_64-2.7/Crypto/Random/Fortuna                                                      
  copying lib/Crypto/Random/Fortuna/FortunaAccumulator.py -> build/lib.linux-x86_64-2.7/Crypto/Random/Fortuna                                                    
  copying lib/Crypto/Random/Fortuna/SHAd256.py -> build/lib.linux-x86_64-2.7/Crypto/Random/Fortuna                                                               
  copying lib/Crypto/Random/Fortuna/__init__.py -> build/lib.linux-x86_64-2.7/Crypto/Random/Fortuna                                                              
  creating build/lib.linux-x86_64-2.7/Crypto/Random/OSRNG                       
  copying lib/Crypto/Random/OSRNG/rng_base.py -> build/lib.linux-x86_64-2.7/Crypto/Random/OSRNG                                                                  
  copying lib/Crypto/Random/OSRNG/fallback.py -> build/lib.linux-x86_64-2.7/Crypto/Random/OSRNG                                                                  
  copying lib/Crypto/Random/OSRNG/nt.py -> build/lib.linux-x86_64-2.7/Crypto/Random/OSRNG                                                                        
  copying lib/Crypto/Random/OSRNG/__init__.py -> build/lib.linux-x86_64-2.7/Crypto/Random/OSRNG                                                                  
  copying lib/Crypto/Random/OSRNG/posix.py -> build/lib.linux-x86_64-2.7/Crypto/Random/OSRNG                                                                     
  creating build/lib.linux-x86_64-2.7/Crypto/SelfTest                           
  copying lib/Crypto/SelfTest/st_common.py -> build/lib.linux-x86_64-2.7/Crypto/SelfTest                                                                         
  copying lib/Crypto/SelfTest/__init__.py -> build/lib.linux-x86_64-2.7/Crypto/SelfTest                                                                          
  creating build/lib.linux-x86_64-2.7/Crypto/SelfTest/Cipher                    
  copying lib/Crypto/SelfTest/Cipher/test_pkcs1_oaep.py -> build/lib.linux-x86_64-2.7/Crypto/SelfTest/Cipher                                                     
  copying lib/Crypto/SelfTest/Cipher/test_pkcs1_15.py -> build/lib.linux-x86_64-2.7/Crypto/SelfTest/Cipher                                                       
  copying lib/Crypto/SelfTest/Cipher/test_DES3.py -> build/lib.linux-x86_64-2.7/Crypto/SelfTest/Cipher                                                           
  copying lib/Crypto/SelfTest/Cipher/test_ARC4.py -> build/lib.linux-x86_64-2.7/Crypto/SelfTest/Cipher                                                           
  copying lib/Crypto/SelfTest/Cipher/test_DES.py -> build/lib.linux-x86_64-2.7/Crypto/SelfTest/Cipher                                                            
  copying lib/Crypto/SelfTest/Cipher/test_Blowfish.py -> build/lib.linux-x86_64-2.7/Crypto/SelfTest/Cipher                                                       
  copying lib/Crypto/SelfTest/Cipher/test_AES.py -> build/lib.linux-x86_64-2.7/Crypto/SelfTest/Cipher                                                            
  copying lib/Crypto/SelfTest/Cipher/test_ARC2.py -> build/lib.linux-x86_64-2.7/Crypto/SelfTest/Cipher                                                           
  copying lib/Crypto/SelfTest/Cipher/common.py -> build/lib.linux-x86_64-2.7/Crypto/SelfTest/Cipher                                                              
  copying lib/Crypto/SelfTest/Cipher/test_XOR.py -> build/lib.linux-x86_64-2.7/Crypto/SelfTest/Cipher                                                            
  copying lib/Crypto/SelfTest/Cipher/test_CAST.py -> build/lib.linux-x86_64-2.7/Crypto/SelfTest/Cipher                                                           
  copying lib/Crypto/SelfTest/Cipher/__init__.py -> build/lib.linux-x86_64-2.7/Crypto/SelfTest/Cipher                                                            
  creating build/lib.linux-x86_64-2.7/Crypto/SelfTest/Hash                      
  copying lib/Crypto/SelfTest/Hash/test_HMAC.py -> build/lib.linux-x86_64-2.7/Crypto/SelfTest/Hash                                                               
  copying lib/Crypto/SelfTest/Hash/test_SHA384.py -> build/lib.linux-x86_64-2.7/Crypto/SelfTest/Hash                                                             
  copying lib/Crypto/SelfTest/Hash/test_MD5.py -> build/lib.linux-x86_64-2.7/Crypto/SelfTest/Hash                                                                
  copying lib/Crypto/SelfTest/Hash/common.py -> build/lib.linux-x86_64-2.7/Crypto/SelfTest/Hash                                                                  
  copying lib/Crypto/SelfTest/Hash/test_SHA224.py -> build/lib.linux-x86_64-2.7/Crypto/SelfTest/Hash                                                             
  copying lib/Crypto/SelfTest/Hash/test_RIPEMD.py -> build/lib.linux-x86_64-2.7/Crypto/SelfTest/Hash                                                             
  copying lib/Crypto/SelfTest/Hash/test_MD4.py -> build/lib.linux-x86_64-2.7/Crypto/SelfTest/Hash                                                                
  copying lib/Crypto/SelfTest/Hash/test_SHA512.py -> build/lib.linux-x86_64-2.7/Crypto/SelfTest/Hash                                                             
  copying lib/Crypto/SelfTest/Hash/test_SHA.py -> build/lib.linux-x86_64-2.7/Crypto/SelfTest/Hash                                                                
  copying lib/Crypto/SelfTest/Hash/test_SHA256.py -> build/lib.linux-x86_64-2.7/Crypto/SelfTest/Hash                                                             
  copying lib/Crypto/SelfTest/Hash/__init__.py -> build/lib.linux-x86_64-2.7/Crypto/SelfTest/Hash                                                                
  copying lib/Crypto/SelfTest/Hash/test_MD2.py -> build/lib.linux-x86_64-2.7/Crypto/SelfTest/Hash                                                                
  creating build/lib.linux-x86_64-2.7/Crypto/SelfTest/Protocol                  
  copying lib/Crypto/SelfTest/Protocol/test_AllOrNothing.py -> build/lib.linux-x86_64-2.7/Crypto/SelfTest/Protocol                                               
  copying lib/Crypto/SelfTest/Protocol/test_rfc1751.py -> build/lib.linux-x86_64-2.7/Crypto/SelfTest/Protocol                                                    
  copying lib/Crypto/SelfTest/Protocol/test_chaffing.py -> build/lib.linux-x86_64-2.7/Crypto/SelfTest/Protocol                                                   
  copying lib/Crypto/SelfTest/Protocol/__init__.py -> build/lib.linux-x86_64-2.7/Crypto/SelfTest/Protocol                                                        
  copying lib/Crypto/SelfTest/Protocol/test_KDF.py -> build/lib.linux-x86_64-2.7/Crypto/SelfTest/Protocol                                                        
  creating build/lib.linux-x86_64-2.7/Crypto/SelfTest/PublicKey                 
  copying lib/Crypto/SelfTest/PublicKey/test_RSA.py -> build/lib.linux-x86_64-2.7/Crypto/SelfTest/PublicKey                                                      
  copying lib/Crypto/SelfTest/PublicKey/test_DSA.py -> build/lib.linux-x86_64-2.7/Crypto/SelfTest/PublicKey                                                      
  copying lib/Crypto/SelfTest/PublicKey/test_importKey.py -> build/lib.linux-x86_64-2.7/Crypto/SelfTest/PublicKey                                                
  copying lib/Crypto/SelfTest/PublicKey/test_ElGamal.py -> build/lib.linux-x86_64-2.7/Crypto/SelfTest/PublicKey                                                  
  copying lib/Crypto/SelfTest/PublicKey/__init__.py -> build/lib.linux-x86_64-2.7/Crypto/SelfTest/PublicKey                                                      
  creating build/lib.linux-x86_64-2.7/Crypto/SelfTest/Random                    
  copying lib/Crypto/SelfTest/Random/test_rpoolcompat.py -> build/lib.linux-x86_64-2.7/Crypto/SelfTest/Random                                                    
  copying lib/Crypto/SelfTest/Random/test__UserFriendlyRNG.py -> build/lib.linux-x86_64-2.7/Crypto/SelfTest/Random                                               
  copying lib/Crypto/SelfTest/Random/__init__.py -> build/lib.linux-x86_64-2.7/Crypto/SelfTest/Random                                                            
  copying lib/Crypto/SelfTest/Random/test_random.py -> build/lib.linux-x86_64-2.7/Crypto/SelfTest/Random                                                         
  creating build/lib.linux-x86_64-2.7/Crypto/SelfTest/Random/Fortuna            
  copying lib/Crypto/SelfTest/Random/Fortuna/test_FortunaGenerator.py -> build/lib.linux-x86_64-2.7/Crypto/SelfTest/Random/Fortuna                               
  copying lib/Crypto/SelfTest/Random/Fortuna/test_FortunaAccumulator.py -> build/lib.linux-x86_64-2.7/Crypto/SelfTest/Random/Fortuna                             
  copying lib/Crypto/SelfTest/Random/Fortuna/test_SHAd256.py -> build/lib.linux-x86_64-2.7/Crypto/SelfTest/Random/Fortuna                                        
  copying lib/Crypto/SelfTest/Random/Fortuna/__init__.py -> build/lib.linux-x86_64-2.7/Crypto/SelfTest/Random/Fortuna                                            
  creating build/lib.linux-x86_64-2.7/Crypto/SelfTest/Random/OSRNG              
  copying lib/Crypto/SelfTest/Random/OSRNG/test_posix.py -> build/lib.linux-x86_64-2.7/Crypto/SelfTest/Random/OSRNG                                              
  copying lib/Crypto/SelfTest/Random/OSRNG/test_nt.py -> build/lib.linux-x86_64-2.7/Crypto/SelfTest/Random/OSRNG                                                 
  copying lib/Crypto/SelfTest/Random/OSRNG/test_generic.py -> build/lib.linux-x86_64-2.7/Crypto/SelfTest/Random/OSRNG                                            
  copying lib/Crypto/SelfTest/Random/OSRNG/test_winrandom.py -> build/lib.linux-x86_64-2.7/Crypto/SelfTest/Random/OSRNG                                          
  copying lib/Crypto/SelfTest/Random/OSRNG/__init__.py -> build/lib.linux-x86_64-2.7/Crypto/SelfTest/Random/OSRNG                                                
  copying lib/Crypto/SelfTest/Random/OSRNG/test_fallback.py -> build/lib.linux-x86_64-2.7/Crypto/SelfTest/Random/OSRNG                                           
  creating build/lib.linux-x86_64-2.7/Crypto/SelfTest/Util                      
  copying lib/Crypto/SelfTest/Util/test_asn1.py -> build/lib.linux-x86_64-2.7/Crypto/SelfTest/Util                                                               
  copying lib/Crypto/SelfTest/Util/test_number.py -> build/lib.linux-x86_64-2.7/Crypto/SelfTest/Util                                                             
  copying lib/Crypto/SelfTest/Util/test_winrandom.py -> build/lib.linux-x86_64-2.7/Crypto/SelfTest/Util                                                          
  copying lib/Crypto/SelfTest/Util/test_Counter.py -> build/lib.linux-x86_64-2.7/Crypto/SelfTest/Util                                                            
  copying lib/Crypto/SelfTest/Util/__init__.py -> build/lib.linux-x86_64-2.7/Crypto/SelfTest/Util                                                                
  creating build/lib.linux-x86_64-2.7/Crypto/SelfTest/Signature                 
  copying lib/Crypto/SelfTest/Signature/test_pkcs1_pss.py -> build/lib.linux-x86_64-2.7/Crypto/SelfTest/Signature                                                
  copying lib/Crypto/SelfTest/Signature/test_pkcs1_15.py -> build/lib.linux-x86_64-2.7/Crypto/SelfTest/Signature                                                 
  copying lib/Crypto/SelfTest/Signature/__init__.py -> build/lib.linux-x86_64-2.7/Crypto/SelfTest/Signature                                                      
  creating build/lib.linux-x86_64-2.7/Crypto/Protocol                           
  copying lib/Crypto/Protocol/KDF.py -> build/lib.linux-x86_64-2.7/Crypto/Protocol                                                                               
  copying lib/Crypto/Protocol/Chaffing.py -> build/lib.linux-x86_64-2.7/Crypto/Protocol                                                                          
  copying lib/Crypto/Protocol/__init__.py -> build/lib.linux-x86_64-2.7/Crypto/Protocol                                                                          
  copying lib/Crypto/Protocol/AllOrNothing.py -> build/lib.linux-x86_64-2.7/Crypto/Protocol                                                                      
  creating build/lib.linux-x86_64-2.7/Crypto/PublicKey                          
  copying lib/Crypto/PublicKey/RSA.py -> build/lib.linux-x86_64-2.7/Crypto/PublicKey                                                                             
  copying lib/Crypto/PublicKey/ElGamal.py -> build/lib.linux-x86_64-2.7/Crypto/PublicKey                                                                         
  copying lib/Crypto/PublicKey/pubkey.py -> build/lib.linux-x86_64-2.7/Crypto/PublicKey                                                                          
  copying lib/Crypto/PublicKey/_RSA.py -> build/lib.linux-x86_64-2.7/Crypto/PublicKey                                                                            
  copying lib/Crypto/PublicKey/_DSA.py -> build/lib.linux-x86_64-2.7/Crypto/PublicKey                                                                            
  copying lib/Crypto/PublicKey/DSA.py -> build/lib.linux-x86_64-2.7/Crypto/PublicKey                                                                             
  copying lib/Crypto/PublicKey/_slowmath.py -> build/lib.linux-x86_64-2.7/Crypto/PublicKey                                                                       
  copying lib/Crypto/PublicKey/__init__.py -> build/lib.linux-x86_64-2.7/Crypto/PublicKey                                                                        
  creating build/lib.linux-x86_64-2.7/Crypto/Signature                          
  copying lib/Crypto/Signature/PKCS1_v1_5.py -> build/lib.linux-x86_64-2.7/Crypto/Signature                                                                      
  copying lib/Crypto/Signature/PKCS1_PSS.py -> build/lib.linux-x86_64-2.7/Crypto/Signature                                                                       
  copying lib/Crypto/Signature/__init__.py -> build/lib.linux-x86_64-2.7/Crypto/Signature                                                                        
  running build_ext                                                             
  running build_configure                                                       
  checking for gcc... gcc                                                       
  checking whether the C compiler works... yes                                  
  checking for C compiler default output file name... a.out                     
  checking for suffix of executables...                                         
  checking whether we are cross compiling... no                                 
  checking for suffix of object files... o                                      
  checking whether we are using the GNU C compiler... yes                       
  checking whether gcc accepts -g... yes                                        
  checking for gcc option to accept ISO C89... none needed                      
  checking for __gmpz_init in -lgmp... yes                                      
  checking for __gmpz_init in -lmpir... no                                      
  checking whether mpz_powm is declared... yes                                  
  checking whether mpz_powm_sec is declared... yes                              
  checking how to run the C preprocessor... gcc -E                              
  checking for grep that handles long lines and -e... /usr/bin/grep             
  checking for egrep... /usr/bin/grep -E                                        
  checking for ANSI C header files... yes                                       
  checking for sys/types.h... yes                                               
  checking for sys/stat.h... yes                                                
  checking for stdlib.h... yes                                                  
  checking for string.h... yes                                                  
  checking for memory.h... yes                                                  
  checking for strings.h... yes                                                 
  checking for inttypes.h... yes                                                
  checking for stdint.h... yes                                                  
  checking for unistd.h... yes                                                  
  checking for inttypes.h... (cached) yes                                       
  checking limits.h usability... yes                                            
  checking limits.h presence... yes                                             
  checking for limits.h... yes                                                  
  checking stddef.h usability... yes                                            
  checking stddef.h presence... yes                                             
  checking for stddef.h... yes                                                  
  checking for stdint.h... (cached) yes                                         
  checking for stdlib.h... (cached) yes                                         
  checking for string.h... (cached) yes                                         
  checking wchar.h usability... yes                                             
  checking wchar.h presence... yes                                              
  checking for wchar.h... yes                                                   
  checking for inline... inline                                                 
  checking for int16_t... yes                                                   
  checking for int32_t... yes                                                   
  checking for int64_t... yes                                                   
  checking for int8_t... yes                                                    
  checking for size_t... yes                                                    
  checking for uint16_t... yes                                                  
  checking for uint32_t... yes                                                  
  checking for uint64_t... yes                                                  
  checking for uint8_t... yes                                                   
  checking for stdlib.h... (cached) yes                                         
  checking for GNU libc compatible malloc... yes                                
  checking for memmove... yes                                                   
  checking for memset... yes                                                    
  configure: creating ./config.status                                           
  config.status: creating src/config.h                                          
  building 'Crypto.PublicKey._fastmath' extension                               
  creating build/temp.linux-x86_64-2.7                                          
  creating build/temp.linux-x86_64-2.7/src                                      
  x86_64-linux-gnu-gcc -pthread -fno-strict-aliasing -Wdate-time -D_FORTIFY_SOURCE=2 -fdebug-prefix-map=/build/python2.7-uC7NI8/python2.7-2.7.18=. -fstack-protector-strong -Wformat -Werror=format-security -fPIC -std=c99 -O3 -fomit-frame-pointer -Isrc/ -I/usr/include/ -I/usr/include/python2.7 -c src/_fastmath.c -o build/temp.linux-x86_64-2.7/src/_fastmath.o                                              
  src/_fastmath.c:31:10: fatal error: Python.h: Нет такого файла или каталога   
     31 | #include "Python.h"                                                   
        |          ^~~~~~~~~~                                                   
  compilation terminated.                                                       
  error: command 'x86_64-linux-gnu-gcc' failed with exit status 1               
  ----------------------------------------                                      
  ERROR: Failed building wheel for pycrypto
  Running setup.py clean for pycrypto
Failed to build M2Crypto pycrypto
Installing collected packages: M2Crypto, pyminifier, xlwt, xlrd, xlutils, pycrypto
    Running setup.py install for M2Crypto ... error
    ERROR: Command errored out with exit status 1:
     command: /usr/bin/python -u -c 'import sys, setuptools, tokenize; sys.argv[0] = '"'"'/tmp/pip-install-wMjfxq/M2Crypto/setup.py'"'"'; __file__='"'"'/tmp/pip-install-wMjfxq/M2Crypto/setup.py'"'"';f=getattr(tokenize, '"'"'open'"'"', open)(__file__);code=f.read().replace('"'"'\r\n'"'"', '"'"'\n'"'"');f.close();exec(compile(code, __file__, '"'"'exec'"'"'))' install --record /tmp/pip-record-VErJNw/install-record.txt --single-version-externally-managed --compile --install-headers /usr/local/include/python2.7/M2Crypto                                              
         cwd: /tmp/pip-install-wMjfxq/M2Crypto/                                 
    Complete output (55 lines):                                                 
    running install                                                             
    running build                                                               
    running build_py                                                            
    creating build                                                              
    creating build/lib.linux-x86_64-2.7                                         
    creating build/lib.linux-x86_64-2.7/M2Crypto                                
    copying M2Crypto/callback.py -> build/lib.linux-x86_64-2.7/M2Crypto         
    copying M2Crypto/Rand.py -> build/lib.linux-x86_64-2.7/M2Crypto             
    copying M2Crypto/ftpslib.py -> build/lib.linux-x86_64-2.7/M2Crypto          
    copying M2Crypto/Err.py -> build/lib.linux-x86_64-2.7/M2Crypto              
    copying M2Crypto/RSA.py -> build/lib.linux-x86_64-2.7/M2Crypto              
    copying M2Crypto/SMIME.py -> build/lib.linux-x86_64-2.7/M2Crypto            
    copying M2Crypto/AuthCookie.py -> build/lib.linux-x86_64-2.7/M2Crypto       
    copying M2Crypto/m2.py -> build/lib.linux-x86_64-2.7/M2Crypto               
    copying M2Crypto/EC.py -> build/lib.linux-x86_64-2.7/M2Crypto               
    copying M2Crypto/m2urllib.py -> build/lib.linux-x86_64-2.7/M2Crypto         
    copying M2Crypto/httpslib.py -> build/lib.linux-x86_64-2.7/M2Crypto         
    copying M2Crypto/m2xmlrpclib.py -> build/lib.linux-x86_64-2.7/M2Crypto      
    copying M2Crypto/m2crypto.py -> build/lib.linux-x86_64-2.7/M2Crypto         
    copying M2Crypto/util.py -> build/lib.linux-x86_64-2.7/M2Crypto             
    copying M2Crypto/DSA.py -> build/lib.linux-x86_64-2.7/M2Crypto              
    copying M2Crypto/RC4.py -> build/lib.linux-x86_64-2.7/M2Crypto              
    copying M2Crypto/Engine.py -> build/lib.linux-x86_64-2.7/M2Crypto           
    copying M2Crypto/BN.py -> build/lib.linux-x86_64-2.7/M2Crypto               
    copying M2Crypto/ASN1.py -> build/lib.linux-x86_64-2.7/M2Crypto             
    copying M2Crypto/m2urllib2.py -> build/lib.linux-x86_64-2.7/M2Crypto        
    copying M2Crypto/six.py -> build/lib.linux-x86_64-2.7/M2Crypto              
    copying M2Crypto/X509.py -> build/lib.linux-x86_64-2.7/M2Crypto             
    copying M2Crypto/EVP.py -> build/lib.linux-x86_64-2.7/M2Crypto              
    copying M2Crypto/BIO.py -> build/lib.linux-x86_64-2.7/M2Crypto              
    copying M2Crypto/DH.py -> build/lib.linux-x86_64-2.7/M2Crypto               
    copying M2Crypto/__init__.py -> build/lib.linux-x86_64-2.7/M2Crypto         
    copying M2Crypto/threading.py -> build/lib.linux-x86_64-2.7/M2Crypto        
    creating build/lib.linux-x86_64-2.7/M2Crypto/SSL                            
    copying M2Crypto/SSL/TwistedProtocolWrapper.py -> build/lib.linux-x86_64-2.7/M2Crypto/SSL                                                                    
    copying M2Crypto/SSL/Session.py -> build/lib.linux-x86_64-2.7/M2Crypto/SSL  
    copying M2Crypto/SSL/timeout.py -> build/lib.linux-x86_64-2.7/M2Crypto/SSL  
    copying M2Crypto/SSL/Checker.py -> build/lib.linux-x86_64-2.7/M2Crypto/SSL  
    copying M2Crypto/SSL/cb.py -> build/lib.linux-x86_64-2.7/M2Crypto/SSL       
    copying M2Crypto/SSL/Cipher.py -> build/lib.linux-x86_64-2.7/M2Crypto/SSL   
    copying M2Crypto/SSL/Context.py -> build/lib.linux-x86_64-2.7/M2Crypto/SSL  
    copying M2Crypto/SSL/ssl_dispatcher.py -> build/lib.linux-x86_64-2.7/M2Crypto/SSL                                                                            
    copying M2Crypto/SSL/SSLServer.py -> build/lib.linux-x86_64-2.7/M2Crypto/SSL
    copying M2Crypto/SSL/Connection.py -> build/lib.linux-x86_64-2.7/M2Crypto/SSL
    copying M2Crypto/SSL/__init__.py -> build/lib.linux-x86_64-2.7/M2Crypto/SSL 
    running build_ext                                                           
    building 'M2Crypto._m2crypto' extension                                     
    creating build/temp.linux-x86_64-2.7                                        
    creating build/temp.linux-x86_64-2.7/SWIG                                   
    x86_64-linux-gnu-gcc -pthread -fno-strict-aliasing -Wdate-time -D_FORTIFY_SOURCE=2 -g -fdebug-prefix-map=/build/python2.7-uC7NI8/python2.7-2.7.18=. -fstack-protector-strong -Wformat -Werror=format-security -fPIC -I/usr/include/python2.7 -I/tmp/pip-install-wMjfxq/M2Crypto/SWIG -c SWIG/_m2crypto_wrap.c -o build/temp.linux-x86_64-2.7/SWIG/_m2crypto_wrap.o -Wno-deprecated-declarations -DTHREADING     
    SWIG/_m2crypto_wrap.c:127:10: fatal error: Python.h: Нет такого файла или каталога                                                                           
      127 | #include <Python.h>                                                 
          |          ^~~~~~~~~~                                                 
    compilation terminated.                                                     
    error: command 'x86_64-linux-gnu-gcc' failed with exit status 1             
    ----------------------------------------                                    
ERROR: Command errored out with exit status 1: /usr/bin/python -u -c 'import sys, setuptools, tokenize; sys.argv[0] = '"'"'/tmp/pip-install-wMjfxq/M2Crypto/setup.py'"'"'; __file__='"'"'/tmp/pip-install-wMjfxq/M2Crypto/setup.py'"'"';f=getattr(tokenize, '"'"'open'"'"', open)(__file__);code=f.read().replace('"'"'\r\n'"'"', '"'"'\n'"'"');f.close();exec(compile(code, __file__, '"'"'exec'"'"'))' install --record /tmp/pip-record-VErJNw/install-record.txt --single-version-externally-managed --compile --install-headers /usr/local/include/python2.7/M2Crypto Check the logs for full command output.                                                      
cat: /etc/lsb-release: Нет такого файла или каталога
cat: /etc/lsb-release: Нет такого файла или каталога
cat: /etc/lsb-release: Нет такого файла или каталога
cat: /etc/lsb-release: Нет такого файла или каталога
ls: невозможно получить доступ к '/opt/microsoft/powershell/*/DELETE_ME_TO_DISABLE_CONSOLEHOST_TELEMETRY': Нет такого файла или каталога
Надеюсь мой случай можно решить. Большое спасибо заранеe.
 

Вложения

  • install.zip
    6,8 КБ · Просмотры: 194

tawutawu

New member
02.07.2020
3
0
BIT
0
а для чего ЗИП файл??
install.sh не принимается

а для чего ЗИП файл??
может быть в нем ошибка

а для чего ЗИП файл??
я попробю на Debian и Fedora может из-за того что у меня какой-то не рабочий kali и ubuntu
 
Мы в соцсетях:

Обучение наступательной кибербезопасности в игровой форме. Начать игру!