РАЗБОР
Kali Linux на виртуальной машине не видит адаптер альфу
[ обложка статьи ]
Режим чтения
Kali Linux на виртуальной машине не видет адаптер альфу
AI-выжимка
сгенерировано ИИ
Тезисы статьи скоро
Статья читается полностью. Тезисы со ссылками на разделы появятся позже.
Содержание
Связанное по теме
Codeby Academy
Практика и мастерство
От основ до продвинутого — программы для практиков Codeby.
Перейти к курсу →
Установка драйвера Alfa AWUS036ACH в Kali Linux | Интернет-магазин Wi-Fi оборудования ТехноТрейдСделал обновления системы и все по нулям
До этого все прекрасно работало сдох жесткий и понеслась
1-до какого момента и в каких краях у Вас всё работало(на виртуалке или полноценно на ноуте до краша жд)?Как обновить драйвера если не сложно подскажите
Или альфа не подойдет для 2019.1
2-сейчас, на данный момент, kali находится на виртуалке?
Не попробовали?Работала на виртуалке сломался жд. Купил другой скачал виртуалку и кали 2019.1 в интернет с виртуалки выход есть а альфу и wi fi не видеть. Пишет что нет подключенных wi fi модулей. При повторном втыкании альфы вылазиет окно что он не обнаружено
git clone -b v4.3.21 astsam/rtl8812au # скачиваем драйвер из репозитория github или качаем с сайта и распаковываем
cd rtl8812au # переходим в каталог со скачанным драйвером
make # компилируем драйвер
sudo make install # устанавливаем драйвер
У тебя драйвер в загрузках,а ты пытаешься открыть его в дом каталоге!При запуске вм пишет ошибку. Скачал rtl8812au в вожу пищетчто драйвер не найден где я лопухнулся
Удачи
А как его открыть git clone
Мне надо указать папку где он лежит?У тебя драйвер в загрузках,а ты пытаешься открыть его в дом каталоге!
Удачи
Он в загрузках его от туда надо устно вить?Не попробовали?
git clone -b v4.3.21 astsam/rtl8812au # скачиваем драйвер из репозитория github или качаем с сайта и распаковываем
cd rtl8812au # переходим в каталог со скачанным драйвером
make # компилируем драйвер
sudo make install # устанавливаем драйвер
Верно, да.Он в загрузках его от туда надо устно вить?
Команда make и указать папку?Верно, да.
Да перейдите в эту папку и оттуда скомпилируйте.Команда make и указать папку?
Зайдите в папку с драйвером, далее правой кнопкой мыши - открыть в терминале - вводим команду "make" получаем вот это:Команда make и указать папку?
"******************************************"
"NO SKRC,we will use default KSRC"
"******************************************"
make ARCH=x86_64 CROSS_COMPILE= -C /lib/modules/4.19.0-kali4-amd64/build M=/root/Desktop/kernel/drivers/TL-WN722N_v2.0-Ralink/rtl8188EUS_linux_v4.3.0.8_13968.20150417-target-kernel_4.4 modules
make[1]: вход в каталог «/usr/src/linux-headers-4.19.0-kali4-amd64»
"******************************************"
"NO SKRC,we will use default KSRC"
"******************************************"
CC [M] /root/Desktop/kernel/drivers/TL-WN722N_v2.0-Ralink/rtl8188EUS_linux_v4.3.0.8_13968.20150417-target-kernel_4.4/core/rtw_cmd.o
In file included from /root/Desktop/kernel/drivers/TL-WN722N_v2.0-Ralink/rtl8188EUS_linux_v4.3.0.8_13968.20150417-target-kernel_4.4/include/osdep_service.h:41,
from /root/Desktop/kernel/drivers/TL-WN722N_v2.0-Ralink/rtl8188EUS_linux_v4.3.0.8_13968.20150417-target-kernel_4.4/include/drv_types.h:32,
from /root/Desktop/kernel/drivers/TL-WN722N_v2.0-Ralink/rtl8188EUS_linux_v4.3.0.8_13968.20150417-target-kernel_4.4/core/rtw_cmd.c:22:
/root/Desktop/kernel/drivers/TL-WN722N_v2.0-Ralink/rtl8188EUS_linux_v4.3.0.8_13968.20150417-target-kernel_4.4/include/osdep_service_linux.h: In function ‘_init_timer’:
/root/Desktop/kernel/drivers/TL-WN722N_v2.0-Ralink/rtl8188EUS_linux_v4.3.0.8_13968.20150417-target-kernel_4.4/include/osdep_service_linux.h:261:8: error: ‘_timer’ {aka ‘struct timer_list’} has no member named ‘data’
ptimer->data = (unsigned long)cntx;
^~
/root/Desktop/kernel/drivers/TL-WN722N_v2.0-Ralink/rtl8188EUS_linux_v4.3.0.8_13968.20150417-target-kernel_4.4/include/osdep_service_linux.h:262:2: error: implicit declaration of function ‘init_timer’; did you mean ‘_init_timer’? [-Werror=implicit-function-declaration]
init_timer(ptimer);
^~~~~~~~~~
_init_timer
In file included from /root/Desktop/kernel/drivers/TL-WN722N_v2.0-Ralink/rtl8188EUS_linux_v4.3.0.8_13968.20150417-target-kernel_4.4/include/drv_types.h:35,
from /root/Desktop/kernel/drivers/TL-WN722N_v2.0-Ralink/rtl8188EUS_linux_v4.3.0.8_13968.20150417-target-kernel_4.4/core/rtw_cmd.c:22:
/root/Desktop/kernel/drivers/TL-WN722N_v2.0-Ralink/rtl8188EUS_linux_v4.3.0.8_13968.20150417-target-kernel_4.4/include/wifi.h: At top level:
/root/Desktop/kernel/drivers/TL-WN722N_v2.0-Ralink/rtl8188EUS_linux_v4.3.0.8_13968.20150417-target-kernel_4.4/include/wifi.h:988: warning: "IEEE80211_MAX_AMPDU_BUF" redefined
#define IEEE80211_MAX_AMPDU_BUF 0x40
In file included from /usr/src/linux-headers-4.19.0-kali4-common/include/net/cfg80211.h:24,
from /root/Desktop/kernel/drivers/TL-WN722N_v2.0-Ralink/rtl8188EUS_linux_v4.3.0.8_13968.20150417-target-kernel_4.4/include/osdep_service_linux.h:83,
from /root/Desktop/kernel/drivers/TL-WN722N_v2.0-Ralink/rtl8188EUS_linux_v4.3.0.8_13968.20150417-target-kernel_4.4/include/osdep_service.h:41,
from /root/Desktop/kernel/drivers/TL-WN722N_v2.0-Ralink/rtl8188EUS_linux_v4.3.0.8_13968.20150417-target-kernel_4.4/include/drv_types.h:32,
from /root/Desktop/kernel/drivers/TL-WN722N_v2.0-Ralink/rtl8188EUS_linux_v4.3.0.8_13968.20150417-target-kernel_4.4/core/rtw_cmd.c:22:
/usr/src/linux-headers-4.19.0-kali4-common/include/linux/ieee80211.h:1442: note: this is the location of the previous definition
#define IEEE80211_MAX_AMPDU_BUF 0x100
cc1: some warnings being treated as errors
make[4]: *** [/usr/src/linux-headers-4.19.0-kali4-common/scripts/Makefile.build:309: /root/Desktop/kernel/drivers/TL-WN722N_v2.0-Ralink/rtl8188EUS_linux_v4.3.0.8_13968.20150417-target-kernel_4.4/core/rtw_cmd.o] Ошибка 1
make[3]: *** [/usr/src/linux-headers-4.19.0-kali4-common/Makefile:1535: _module_/root/Desktop/kernel/drivers/TL-WN722N_v2.0-Ralink/rtl8188EUS_linux_v4.3.0.8_13968.20150417-target-kernel_4.4] Ошибка 2
make[2]: *** [Makefile:146: sub-make] Ошибка 2
make[1]: *** [Makefile:8: all] Ошибка 2
make[1]: выход из каталога «/usr/src/linux-headers-4.19.0-kali4-amd64»
make: *** [Makefile:1367: modules] Ошибка 2
"NO SKRC,we will use default KSRC"
"******************************************"
make ARCH=x86_64 CROSS_COMPILE= -C /lib/modules/4.19.0-kali4-amd64/build M=/root/Desktop/kernel/drivers/TL-WN722N_v2.0-Ralink/rtl8188EUS_linux_v4.3.0.8_13968.20150417-target-kernel_4.4 modules
make[1]: вход в каталог «/usr/src/linux-headers-4.19.0-kali4-amd64»
"******************************************"
"NO SKRC,we will use default KSRC"
"******************************************"
CC [M] /root/Desktop/kernel/drivers/TL-WN722N_v2.0-Ralink/rtl8188EUS_linux_v4.3.0.8_13968.20150417-target-kernel_4.4/core/rtw_cmd.o
In file included from /root/Desktop/kernel/drivers/TL-WN722N_v2.0-Ralink/rtl8188EUS_linux_v4.3.0.8_13968.20150417-target-kernel_4.4/include/osdep_service.h:41,
from /root/Desktop/kernel/drivers/TL-WN722N_v2.0-Ralink/rtl8188EUS_linux_v4.3.0.8_13968.20150417-target-kernel_4.4/include/drv_types.h:32,
from /root/Desktop/kernel/drivers/TL-WN722N_v2.0-Ralink/rtl8188EUS_linux_v4.3.0.8_13968.20150417-target-kernel_4.4/core/rtw_cmd.c:22:
/root/Desktop/kernel/drivers/TL-WN722N_v2.0-Ralink/rtl8188EUS_linux_v4.3.0.8_13968.20150417-target-kernel_4.4/include/osdep_service_linux.h: In function ‘_init_timer’:
/root/Desktop/kernel/drivers/TL-WN722N_v2.0-Ralink/rtl8188EUS_linux_v4.3.0.8_13968.20150417-target-kernel_4.4/include/osdep_service_linux.h:261:8: error: ‘_timer’ {aka ‘struct timer_list’} has no member named ‘data’
ptimer->data = (unsigned long)cntx;
^~
/root/Desktop/kernel/drivers/TL-WN722N_v2.0-Ralink/rtl8188EUS_linux_v4.3.0.8_13968.20150417-target-kernel_4.4/include/osdep_service_linux.h:262:2: error: implicit declaration of function ‘init_timer’; did you mean ‘_init_timer’? [-Werror=implicit-function-declaration]
init_timer(ptimer);
^~~~~~~~~~
_init_timer
In file included from /root/Desktop/kernel/drivers/TL-WN722N_v2.0-Ralink/rtl8188EUS_linux_v4.3.0.8_13968.20150417-target-kernel_4.4/include/drv_types.h:35,
from /root/Desktop/kernel/drivers/TL-WN722N_v2.0-Ralink/rtl8188EUS_linux_v4.3.0.8_13968.20150417-target-kernel_4.4/core/rtw_cmd.c:22:
/root/Desktop/kernel/drivers/TL-WN722N_v2.0-Ralink/rtl8188EUS_linux_v4.3.0.8_13968.20150417-target-kernel_4.4/include/wifi.h: At top level:
/root/Desktop/kernel/drivers/TL-WN722N_v2.0-Ralink/rtl8188EUS_linux_v4.3.0.8_13968.20150417-target-kernel_4.4/include/wifi.h:988: warning: "IEEE80211_MAX_AMPDU_BUF" redefined
#define IEEE80211_MAX_AMPDU_BUF 0x40
In file included from /usr/src/linux-headers-4.19.0-kali4-common/include/net/cfg80211.h:24,
from /root/Desktop/kernel/drivers/TL-WN722N_v2.0-Ralink/rtl8188EUS_linux_v4.3.0.8_13968.20150417-target-kernel_4.4/include/osdep_service_linux.h:83,
from /root/Desktop/kernel/drivers/TL-WN722N_v2.0-Ralink/rtl8188EUS_linux_v4.3.0.8_13968.20150417-target-kernel_4.4/include/osdep_service.h:41,
from /root/Desktop/kernel/drivers/TL-WN722N_v2.0-Ralink/rtl8188EUS_linux_v4.3.0.8_13968.20150417-target-kernel_4.4/include/drv_types.h:32,
from /root/Desktop/kernel/drivers/TL-WN722N_v2.0-Ralink/rtl8188EUS_linux_v4.3.0.8_13968.20150417-target-kernel_4.4/core/rtw_cmd.c:22:
/usr/src/linux-headers-4.19.0-kali4-common/include/linux/ieee80211.h:1442: note: this is the location of the previous definition
#define IEEE80211_MAX_AMPDU_BUF 0x100
cc1: some warnings being treated as errors
make[4]: *** [/usr/src/linux-headers-4.19.0-kali4-common/scripts/Makefile.build:309: /root/Desktop/kernel/drivers/TL-WN722N_v2.0-Ralink/rtl8188EUS_linux_v4.3.0.8_13968.20150417-target-kernel_4.4/core/rtw_cmd.o] Ошибка 1
make[3]: *** [/usr/src/linux-headers-4.19.0-kali4-common/Makefile:1535: _module_/root/Desktop/kernel/drivers/TL-WN722N_v2.0-Ralink/rtl8188EUS_linux_v4.3.0.8_13968.20150417-target-kernel_4.4] Ошибка 2
make[2]: *** [Makefile:146: sub-make] Ошибка 2
make[1]: *** [Makefile:8: all] Ошибка 2
make[1]: выход из каталога «/usr/src/linux-headers-4.19.0-kali4-amd64»
make: *** [Makefile:1367: modules] Ошибка 2
В общем не в том месте пытался скомпилировать. На самом деле всё просто - качаем в домашнюю папку, заходим в папку с драйвером - компилируем утилитой make (команда - "make all") и устанавливаем (команда - "make install"). После этого у меня свисток принял определился и заработал как надо.
Здравствуйте. Я зашел в загрузки открыл папку в терминале написал команду make all . Затем ввел make install пишет не удалось выполнить Stat для 8812Ai. Koнет такого файлаВ общем не в том месте пытался скомпилировать. На самом деле всё просто - качаем в домашнюю папку, заходим в папку с драйвером - компилируем утилитой make (команда - "make all") и устанавливаем (команда - "make install"). После этого у меня свисток принял определился и заработал как надо.
Я установил его в документы правельна?Верно, да.
Скажите почему когда я подключаю адаптер у меня пишет не удалось подсоеденить USB устройство Ralink 802.11 n WLAN [0101] к вертуальной машинеДа перейдите в эту папку и оттуда скомпилируйте.
1. Usb устройство добавлено в самой VM?(создан соответствующий фильтр или нет)
2. Попробуй в VM выбрать версию USB 1.0
3. вывод lsusb и dmesg сразу после загрузки студию.
2. Попробуй в VM выбрать версию USB 1.0
3. вывод lsusb и dmesg сразу после загрузки студию.
Поиск в обсуждении
Продолжить чтение
Следующий разбор
SOC будущего: почему сигнатурный анализ устарел
Комментарии
31